由买买提看人间百态

topics

全部话题 - 话题: error
1 2 3 4 5 6 7 8 9 10 下页 末页 (共10页)
W***o
发帖数: 6519
1
I'm running GATK downloaded from Broad Institute, when I run their .jar file
, I got below error. i guess this may be because of the awt headless setting
is wrong? I ran the .jar file on a remote Mac server through SSH, I guess
the program cannot initiate a window (awt swing?), it complains like below.
How can I fix this? - thanks a lot
##### ERROR ----------------------------------------------------------------
--------------------------
##### ERROR A GATK RUNTIME ERROR has occurred (version 2.... 阅读全帖
S*****t
发帖数: 637
2
来自主题: sysop版 - Seek errors
5.1.4 Seek errors
A seek error is defined as a failure of the drive to position the heads
to the addressed track. There shall be no
more than ten recoverable seek errors in 10 8 physical seek operations.
After detecting an initial seek error, the
drive automatically performs an error recovery process. If the error
recovery process fails, a seek positioning
error (15h) is reported with a Medium error (3h) or Hardware error
(4h) reported in the Sense Key. This is an
unrecoverable seek error. Unrec
y****e
发帖数: 23939
3
This line of code:
static int k_means_cont_table_(int * grp1, int * grp2, int * stb, long s1,
long s2, int flag);
always report error:
error C2143: syntax error : missing ')' before 'constant'
error C2143: syntax error : missing ';' before 'constant'
error C2059: syntax error : ')'
error C2238: unexpected token(s) preceding ';'
If I comment out this line and the corresponding code in cpp, then it
compiles OK. I checked it again and again, it looks innocent. What could be
the reason for this erro
t****t
发帖数: 6806
4
error C2143: syntax error : missing ')' before 'constant'
error C2143: syntax error : missing ';' before 'constant'
error C2059: syntax error : ')'
error C2238: unexpected token(s) preceding ';'
I don't see symbol "constant" anywhere. which line is the error message
refering to?

s1,
w****e
发帖数: 707
5
Early ThanksGiving happened on Walmart today! Ordered 5 27" LCD monitor,
high-end projectors just for $9 each.
Walmart.com
Walmart says that a technical error on its website erroneously led to super
low prices on Nov. 6, 2013.
A spokesman for Walmart said the company is still scanning the millions of
items on its site to see if there are still any technical errors causing
price discrepancies.
Walmart assured the media that the site was not hacked.
Read More: Walmart Says Allowing Food Stamp Shop... 阅读全帖
U******u
发帖数: 5829
6
来自主题: Tennis版 - 雷锋转帖:Reducing Errors
Reducing Errors
Friday, March 22, 2013/byMultiple Authors
----------------------------------------------------------------------------
----
As everybody knows, tennis is a game of errors. Deciphering the actual cause
of the error is the initial step in error reduction. A study that I
conducted with nationally ranked juniors in Southern California found that
in match play, there are four main causes of errors:
1. Poor shot selection (46 percent)
2. Below-par movement and spacing (32 percent)
3. I... 阅读全帖
W**********U
发帖数: 132
7
Sorry that I could not type Chinese at this moment.
I am reading a book and it has the following statement about error-
correcting code: "While it is easy to construct Hamming code that can
sustain one error, it is pretty inefficient to generate an error-correcting
code that contains n bits per block and still survive, say, n - 2 errors."
Does "survive" mean correcting here? If yes, can somebody give a CONCRETE
example of error-correcting code that contains n bits per block and can "
survive" n... 阅读全帖
xt
发帖数: 17532
8
我在web.xml上面设置了对code 500的map:
...

500
faces/error.jsp

然后发现以下问题:
1) 我不能再error.jsp里面用,只能用
否则出错;
2) 如果用,页面在显示的时候在tag的位置上出现
com.sun.faces.saveStateFieldMarker
这到底是什么问题?
h**********c
发帖数: 4120
9
来自主题: Programming版 - Visual C++ 高手帮忙,一个Link Error
Just jumped a similar error of a project of my own:
LINK : debug\qtwagon2012.exe not found or not built by the last incremental
link; performing full link
Creating library debug\qtwagon2012.lib and object debug\qtwagon2012.exp
glwidget.obj : error LNK2019: unresolved external symbol "public: static
class qtLight * __cdecl qtLightSingleton::getInstance(void)" ([email protected]
[email protected]@[email protected]@XZ) referenced in fu
nction "public: void __thiscall GLWidget::slotLight3dMoveOrders(int,... 阅读全帖
W**********U
发帖数: 132
10
来自主题: Mathematics版 - A question about error-correcting code
Sorry that I could not type Chinese at this moment.
I am reading a book and it has the following statement about error-
correcting code: "While it is easy to construct Hamming code that can
sustain one error, it is pretty inefficient to generate an error-correcting
code that contains n bits per block and still survive, say, n - 2 errors."
Does "survive" mean correcting here? If yes, can somebody give a CONCRETE
example of error-correcting code that contains n bits per block and can "
survive" n... 阅读全帖
m*******g
发帖数: 3044
11
来自主题: Statistics版 - where is error in SAS
just run SAS, got error message:
ERROR 22-322: Syntax error, expecting one of the following: GROUP, HAVING,
ORDER, WHERE.
ERROR 76-322: Syntax error, statement will be ignored.
318
319 where
320 b.moend=ldf.monthend and
321 b.ay=ldf.ay;
322 quit;
NOTE: The SAS System stopped processing this step because of errors.
NOTE: PROCEDURE SQL used (Total process time):
real time 0.01 seconds
cpu time 0.01 seconds
my code is :
proc sql;
create table sasuser.aggloss_mcr... 阅读全帖
d******e
发帖数: 7844
12
http://mathworld.wolfram.com/StandardError.html
There appear to be two different definitions of the standard error.
The standard error of a sample of sample size n is the sample's standard
deviation divided by sqrt(n). It therefore estimates the standard deviation
of the sample mean based on the population mean
这种有专门的称呼,是SEM。
The standard error of an estimate may also be defined as the square root of
the estimated error variance sigma^2 of the quantity,
自己看。这个是大家常说的定义。
你所说的“特殊东西”不外乎是一个empirical ... 阅读全帖
p******e
发帖数: 897
13
President Donald Trump has now golfed for three consecutive days, despite
the fact that he vowed to get back to work on the day after Christmas.
While there’s nothing inherently wrong with the president golfing, it does
make things awkward for Trump given his past relentless criticism of former
President Barack Obama’s golfing habits.
Given this, Trump has repeatedly downplayed or tried to conceal his own
golfing exploits, despite the fact that he has hit the links in his first
year more times t... 阅读全帖
H*7
发帖数: 4894
14
新的 nex3,读完手册,看到可以用SD储存卡。而以前索尼只能他门家自己的 记忆条
。 先用一个16G 的SDHC 卡,先显示 database file error, 接着显示 image
database file not found, creat?
第一次,我cancel 他们的要求,没有 creat. 但是那个 error 标识一直在屏幕上显示
。先照了几张。也能 在相机上review 。但是没有在电脑上看。 把卡拔出来又查进去
,因为那个 error 标识一直显示 , 就 按照他们的要求 creat the file. 那个error
标识是没有了。 又照了几张。 也可以在相机上review. 但是把卡拔出来放在电脑上
看的时候,电脑检测不到文件,而要 格式化 那张卡。 没有格式化,把卡再放进相机
, 相机也打不开。
第二次,又换了张 sandisk 的 SDHC, 没有 creat the file. 可以照相,在相机和电
脑上review. 但就是那个 error 标识 一直在屏幕上显示。
有人知道怎么回事么? 是不是我的 sd 卡级别不够高。 手册上说要用 clas... 阅读全帖
l******9
发帖数: 579
15
【 以下文字转载自 JobHunting 讨论区 】
发信人: light009 (light009), 信区: JobHunting
标 题: error of create ASP.net project in Visual Studio 2013
发信站: BBS 未名空间站 (Sun Nov 23 18:17:40 2014, 美东)
I would like to build a new project for ASP.NET Web API in Visual Studio
2013 on win 7.
I am doing a lab at:
http://www.asp.net/web-api/overview/getting-started-with-aspnet
But, in the first step of "Create a Web API Project", I followed the
instructions:
"In the New ASP.NET Project dialog, select the Empty template. Unde... 阅读全帖
a***h
发帖数: 29
16
来自主题: Database版 - replicaton: error 14010
i setup merge replication via RAS. i encounter some
problems.
Error 14010:
Last action: The subscription to publication "t1" is invalid
Last command: {call sp_MSgetreplicainfo(?,?,?,?,?,?,?)}
Error information:
Catagory: Data source
Source: 192.168.22.3
Number: 14010
Full error: The remote server is not defined as a
subscription server.
i always encounter error 14010 when i try to setup merge
replication in RAS connection, and sometimes i encounter
this error in intranet connection.
In fact, i h
a***h
发帖数: 29
17
merge replication: error 14010, after the step "bulk copied
data into table 'sysmergesubsetfilter'"
i setup merge replication via RAS. i encounter some
problems.
Error 14010:
Last action: The subscription to publication "t1" is invalid
Last command: {call sp_MSgetreplicainfo(?,?,?,?,?,?,?)}
Error information:
Catagory: Data source
Source: 192.168.22.3
Number: 14010
Full error: The remote server is not defined as a
subscription server.
i always encounter error 14010 when i try to setup merge
repl
l******9
发帖数: 579
18
【 以下文字转载自 JobHunting 讨论区 】
发信人: light009 (light009), 信区: JobHunting
标 题: error export sql table from IBM netezza database to a file
发信站: BBS 未名空间站 (Fri Nov 28 16:33:15 2014, 美东)
I would like to export a data table from IBM netezza SQL daatbase in Aginity
workbench to a txt file on win 7.
I called The sql query from C# in visual studio 2013:
CREATE EXTERNAL TABLE 'C:\path\my_name.txt'
USING
(
Y2BASE 2000
ENCODING 'internal'
REMOTESOURCE 'ODBC'
E... 阅读全帖
l******9
发帖数: 579
19
【 以下文字转载自 JobHunting 讨论区 】
发信人: light009 (light009), 信区: JobHunting
标 题: Error of SQL query on IBM netezza SQL database from Aginity workbench
发信站: BBS 未名空间站 (Fri Dec 5 16:46:56 2014, 美东)
I need to so a sql query on IBM netezza sql database from Aginity workbench
on win7.
My query:
SELECT *
from table1 AS c ,
table2 AS b
where CAST(c.id as int) = b.id
in table1, id is character varying(20) and in table2, id is int.
Table1:
id value1 value2
'985' 'casdqwdc' '654.3184' // t... 阅读全帖
w*s
发帖数: 7227
20
my DB is in the local pc, some times my program gave such errors, while most
of the time is ok.
any suggestions ?
Unhandled Exception: System.Data.EntityException: The underlying provider
failed
on Open. ---> System.Data.SqlClient.SqlException: A network-related or
instance
-specific error occurred while establishing a connection to SQL Server. The
serv
er was not found or was not accessible. Verify that the instance name is
correct
and that SQL Server is configured to allow remote connections. ... 阅读全帖
F*******i
发帖数: 190
21
来自主题: Linux版 - debian apt-get error:
Setting up ia32-libwmf0.2-7 (0.2.8.4-6.1~22) ...
W: libwmf0.2-7: Application not found.
dpkg: error processing ia32-libwmf0.2-7 (--configure):
subprocess installed post-installation script returned error exit status 1
Errors were encountered while processing:
ia32-libwmf0.2-7
E: Sub-process /usr/bin/dpkg returned an error code (1)
请问有什么办法可以去掉这个error 吗?
Thanks!
n**d
发帖数: 9764
22
来自主题: Programming版 - fatal error C1001: INTERNAL COMPILER ERROR
I got this error from VC++. By google, it seems a Microsoft bug. Any
solution?
D:\abc.cpp(8) : fatal error C1001: INTERNAL COMPILER ERROR
(compiler file 'msc1.cpp', line 1786)
Please choose the Technical Support command on the Visual C++
Help menu, or open the Technical Support help file for more
information
Error executing cl.exe.
Here is the code. Line 8 starts by "friend"
1 #include
2 using namespace std;
3
4 class Integer {
5 long i;
6 public:
7 Int
R*********7
发帖数: 61
23
I search google and baidu and did all I can, but without any success.
>LINK : fatal error LNK1168: cannot open
D:\VS2010\Projects\test\Debug\test.exe for writing
It seems that when you exit prompt, the exe is still running
and rise the error when you re-debug a modified file. This error
even occurs for a "Hello World" program!!
The error disappears when I wait for a while or delete the test.exe
in project folder. But only good for one running. When I do some
editing, re-debug it, the error pops
l******9
发帖数: 579
24
【 以下文字转载自 JobHunting 讨论区 】
发信人: light009 (light009), 信区: JobHunting
标 题: biuld error of C# reference of namespace in two projects
发信站: BBS 未名空间站 (Tue Jul 15 21:35:45 2014, 美东)
I am doing C# programming on Visual Studio 2013 win 7.
in project 1 :
using test.name.abc; // error: type or namespace "test" cannot be found.
public class testName2 : testName1 // build error here
{
public int id;
}
in project 2 :
namespace test.name.abc
{
public class testName1
{
public int dd;
... 阅读全帖
l******9
发帖数: 579
25
【 以下文字转载自 JobHunting 讨论区 】
发信人: light009 (light009), 信区: JobHunting
标 题: error of create ASP.net project in Visual Studio 2013
发信站: BBS 未名空间站 (Sun Nov 23 18:17:40 2014, 美东)
I would like to build a new project for ASP.NET Web API in Visual Studio
2013 on win 7.
I am doing a lab at:
http://www.asp.net/web-api/overview/getting-started-with-aspnet
But, in the first step of "Create a Web API Project", I followed the
instructions:
"In the New ASP.NET Project dialog, select the Empty template. Unde... 阅读全帖
l******9
发帖数: 579
26
【 以下文字转载自 JobHunting 讨论区 】
发信人: light009 (light009), 信区: JobHunting
标 题: error export sql table from IBM netezza database to a file
发信站: BBS 未名空间站 (Fri Nov 28 16:33:15 2014, 美东)
I would like to export a data table from IBM netezza SQL daatbase in Aginity
workbench to a txt file on win 7.
I called The sql query from C# in visual studio 2013:
CREATE EXTERNAL TABLE 'C:\path\my_name.txt'
USING
(
Y2BASE 2000
ENCODING 'internal'
REMOTESOURCE 'ODBC'
E... 阅读全帖
l******9
发帖数: 579
27
【 以下文字转载自 JobHunting 讨论区 】
发信人: light009 (light009), 信区: JobHunting
标 题: Error of SQL query on IBM netezza SQL database from Aginity workbench
发信站: BBS 未名空间站 (Fri Dec 5 16:46:56 2014, 美东)
I need to so a sql query on IBM netezza sql database from Aginity workbench
on win7.
My query:
SELECT *
from table1 AS c ,
table2 AS b
where CAST(c.id as int) = b.id
in table1, id is character varying(20) and in table2, id is int.
Table1:
id value1 value2
'985' 'casdqwdc' '654.3184' // t... 阅读全帖
l******9
发帖数: 579
28
【 以下文字转载自 JobHunting 讨论区 】
发信人: light009 (light009), 信区: JobHunting
标 题: error of create ASP.net project in Visual Studio 2013
发信站: BBS 未名空间站 (Sun Nov 23 18:17:40 2014, 美东)
I would like to build a new project for ASP.NET Web API in Visual Studio
2013 on win 7.
I am doing a lab at:
http://www.asp.net/web-api/overview/getting-started-with-aspnet
But, in the first step of "Create a Web API Project", I followed the
instructions:
"In the New ASP.NET Project dialog, select the Empty template. Unde... 阅读全帖
l******9
发帖数: 579
29
【 以下文字转载自 JobHunting 讨论区 】
发信人: light009 (light009), 信区: JobHunting
标 题: error export sql table from IBM netezza database to a file
发信站: BBS 未名空间站 (Fri Nov 28 16:33:15 2014, 美东)
I would like to export a data table from IBM netezza SQL daatbase in Aginity
workbench to a txt file on win 7.
I called The sql query from C# in visual studio 2013:
CREATE EXTERNAL TABLE 'C:\path\my_name.txt'
USING
(
Y2BASE 2000
ENCODING 'internal'
REMOTESOURCE 'ODBC'
E... 阅读全帖
a**m
发帖数: 184
30
laugh
lz was talking about standard error not standard error of the mean
standard error is an estimate of standard deviation
say, you cannot get the standard deviation of the height of chinese women,
cuz you simply cannot sample all of them
however, you can sample (btw, here "sample" refers to measure their height)
1000 of them and get the standard deviation, which, to be more technical,
should be called the standard error.
and this standard error is an unbiased estimate of the standard deviatio... 阅读全帖
a**m
发帖数: 184
31
laugh
lz was talking about standard error not standard error of the mean
standard error is an estimate of standard deviation
say, you cannot get the standard deviation of the height of chinese women,
cuz you simply cannot sample all of them
however, you can sample (btw, here "sample" refers to measure their height)
1000 of them and get the standard deviation, which, to be more technical,
should be called the standard error.
and this standard error is an unbiased estimate of the standard deviatio... 阅读全帖
I***a
发帖数: 704
32
来自主题: EE版 - ISE的map error 求教
Mapping design into LUTs...
ERROR:MapLib:30 - LOC constraint CLOCK on clock<0> is invalid: No such site
on
the device. To bypass this error set the environment variable
'XIL_MAP_LOCWARN'.
ERROR:MapLib:30 - LOC constraint RESET on reset<0> is invalid: No such site
on
the device. To bypass this error set the environment variable
'XIL_MAP_LOCWARN'.
这个ISE的map error有谁知道怎么弄吗?thanks.
l******9
发帖数: 579
33
【 以下文字转载自 JobHunting 讨论区 】
发信人: light009 (light009), 信区: JobHunting
标 题: biuld error of C# reference of namespace in two projects
发信站: BBS 未名空间站 (Tue Jul 15 21:35:45 2014, 美东)
I am doing C# programming on Visual Studio 2013 win 7.
in project 1 :
using test.name.abc; // error: type or namespace "test" cannot be found.
public class testName2 : testName1 // build error here
{
public int id;
}
in project 2 :
namespace test.name.abc
{
public class testName1
{
public int dd;
... 阅读全帖
s*****n
发帖数: 2174
34
脱离type 1 error谈power是没任何意义的.
只有固定一定type 1 error的前提下, power 才是比较test优劣的工具.
否则一个test(比如永远拒绝零假设), 其power可以是1, 但无任何实际意义.
type 1 and 2 errors 一般是此消彼长的. 只有一起谈才有意义.
比如一组test, 有固定的type 2 error, 那type 1 error 自然就成了判别优劣的工具
了.
j*******g
发帖数: 2140
35
来自主题: Statistics版 - 问一个问题: error of ratio
I have two quantities, each of which has an estimated standard error. What
is the standard error of the ratio of these two quantities?
有人给出这两个答案:
1)To find an error, you need to see that is the maximum deviation from the
base value what both x and y change:
d(x/y) = dx*1/y - dy*x/y^2 = (dx/x)*(x/y) - (dy/y)*(x/y)
Note that dx/x and dy/y can be treated as the errors of your quantities.
Also, the maximum total error is a square root of the individual terms in
the above euqation (imagine right tira
a*z
发帖数: 294
36
来自主题: Statistics版 - rggobi on windows 7 error
I would appreciate any help on my issue.
I have R 2.15.2 (32 bit and 64 bit) on a windows 7 ultimate (64 bit system).
I have RGtK2 package installed and updated.
I installed GGOBI (2.1.8, and later changed to 2.1.9) installed on C: drive.
I have gtk+-bundle_2.22.1-20101227_win32 downloaded and unzipped (7 zip) in
C: drive. I set the environment variables in path (c:\ggobi; c:\gtk\bin)
Then I installed rggobi package from CRAN. When I tried to load the package,
I got a popup window saying an erro... 阅读全帖
c**u
发帖数: 14
37
【 以下文字转载自 Military 讨论区 】
发信人: cimu (此木), 信区: Military
标 题: hard to believe: Medical errors are the third-leading cause of death after heart disease and cancer.
发信站: BBS 未名空间站 (Sun Dec 23 12:01:05 2018, 美东)
https://www.cnbc.com/2018/02/22/medical-errors-third-leading-cause-of-death-
in-america.html
- A recent Johns Hopkins study claims more than 250,000 people in the U.S.
die every year from medical errors. Other reports claim the numbers to be as
high as 440,000.
- Medical errors are the third-... 阅读全帖
i******4
发帖数: 20643
38
☆─────────────────────────────────────☆
SceneSweet (景甜) 于 (Sat Apr 28 20:10:55 2012, 美东) 提到:
发信人: ishasha (莎莎), 信区: shopping
标 题: Price Error by Third Party Seller on Amazon?
发信站: BBS 未名空间站 (Fri Apr 27 10:17:00 2012, 美东)
我在Amazon上面买new iPad保护套的时候看到这样一个产品:
http://www.amazon.com/KaysCase-S-Line-Cover-FlipSmart-Folio/dp/
其中黑色,红色和紫色都是$14.99+$1.97运费,买一个皮套加一个塑料背壳。这已经是
一个不错的deal了,可是黑色那款下面有几个第三方卖家列的价钱都相当低,加运费8
块钱都不到。我想从第三方卖家那儿买便宜的,又怕是price error到时候不给寄,然
后正牌店的又卖完了。
大家说进还是不进?
☆──────────────────────... 阅读全帖
s********x
发帖数: 81
39
来自主题: JobHunting版 - leetcode的run time error
大家好,最近做了两题leetcode, 但是都遇到了run time error. 但是我遇到run time
error 的例子在别的c++编译器上都顺利通过了,请大家帮我看一下是什么问题. 谢谢
大家!
问题一:next permutation:
class Solution {
public:
int findSecondMax(vector &num, int cur){
int max1=-1, max2=-2;
int index1=-1, index2=-2;
for(int i=cur; i if(max1 max2=max1;
index2=index1;
max1=num[i];
index1=i;
}
}
if(max2!=-2 || max2!=-1) return index2;
else return index1;
}

... 阅读全帖
l******9
发帖数: 579
40
I am doing C# programming on Visual Studio 2013 win 7.
in project 1 :
using test.name.abc; // error: type or namespace "test" cannot be found.
public class testName2 : testName1 // build error here
{
public int id;
}
in project 2 :
namespace test.name.abc
{
public class testName1
{
public int dd;
}
}
I have added reference of dll file generated from project2 in project1. I
also made the build dependence as project1 depends on project2.
But, I always got build erro... 阅读全帖
l******9
发帖数: 579
41
I would like to build a new project for ASP.NET Web API in Visual Studio
2013 on win 7.
I am doing a lab at:
http://www.asp.net/web-api/overview/getting-started-with-aspnet
But, in the first step of "Create a Web API Project", I followed the
instructions:
"In the New ASP.NET Project dialog, select the Empty template. Under "Add
folders and core references for", check Web API. Click OK."
I got error:
Configuring IIS express failed with the following error:
Filename :
\?\UNCmy_domainmy_nameIISE... 阅读全帖
l******9
发帖数: 579
42
I would like to export a data table from IBM netezza SQL daatbase in Aginity
workbench to a txt file on win 7.
I called The sql query from C# in visual studio 2013:
CREATE EXTERNAL TABLE 'C:\path\my_name.txt'
USING
(
Y2BASE 2000
ENCODING 'internal'
REMOTESOURCE 'ODBC'
ESCAPECHAR ''
)
AS
SELECT *
FROM admin.my_table
I logged in as admin in the database. But, I got error:
Exception captured: System.Data.Odbc.OdbcExce... 阅读全帖
l******9
发帖数: 579
43
I need to so a sql query on IBM netezza sql database from Aginity workbench
on win7.
My query:
SELECT *
from table1 AS c ,
table2 AS b
where CAST(c.id as int) = b.id
in table1, id is character varying(20) and in table2, id is int.
Table1:
id value1 value2
'985' 'casdqwdc' '654.3184' // they are all char
Table2:
id value1
985 694381 // id is int, value1 is int
I got error:
ERROR [HY000] ERROR: pg_atoi: error in "id": can't parse "id"
Any help would be apprec... 阅读全帖
l******9
发帖数: 579
44
【 以下文字转载自 Database 讨论区 】
发信人: light009 (light009), 信区: Database
标 题: Truncation error import csv file to SQL table
发信站: BBS 未名空间站 (Wed Apr 29 15:28:46 2015, 美东)
I would like to import a .csv file into a SQL Server 2008R2 database table
on Win 7.
It has one column and one row.
File1:
name
runeocnu 430274 sjunosnv djduenvop 934m ljfonm3
I got error:
Error 0xc02020a1: Data Flow Task 1: Data conversion failed. The data
conversion for column "NAME" returned status value 4 and status text "Text
w... 阅读全帖
i****e
发帖数: 289
45
来自主题: Reunion版 - 160 retrieve error是怎么回事?
昨晚160最后一步提交了之后出现error,还没显示出来confirmation那页给我打印呢,
然后直到现在每次retrieve都显示已经提交,然后选择view confirmation page那个,
老是出现下面的error msgApplication ErrorAn unexpected error has occurred
while processing your previous request. The error has been reported to the
site administrator; no further action is required. To retrieve your DS-160
application, please enter your Application ID.”
有人遇到过这种情况吗?是现在系统问题还是表我要重填呀?
第二个问题,其实昨天下午已经提交了160一次,然后发现开始选了北京没选广州不让
递签B2签证,然后我又重新填了一个160,现在这个第二个160出问题了,,那提交不止
一份160有问题吗?是不是我只要预约交钱时写... 阅读全帖
d*******k
发帖数: 41
46
今年变成了residential alien,第一次填8833表,efile被拒,收到好多
0033的error:
Fields within a record cannot be longer than specified in
Part 2 Record Layouts. Name Line 1 of the Tax Form can have
a maximum of 35 characters; any more than 35 will be
dropped. See Section 7.02 for Name Line 1 format.
有谁能够解释一下这是什么意思吗?另外,收到的error table有三列,分别
是error code,tax form,和 form #。在form #这一列,出现了00,
02,03,04四种不同的数值,对应的tax form都是8833. 非常看不懂啊。
初来乍到,不晓得怎么贴附件,否则就把收到的error贴上来了。
i*******w
发帖数: 36
47
来自主题: Visa版 - DS 160 Application Error
upload照片成功,点下一步review的时候,出现Error:
Application Error
An unexpected error has occurred while processing your previous request. The
error has been reported to the site administrator; no further action is
required. To retrieve your DS-160 application, please enter your Application
ID.
从上周五到现在都是这样。还有其他人有这个问题吗?

发帖数: 1
48
【 以下文字转载自 JobHunting 讨论区 】
发信人: samshiy001 (), 信区: JobHunting
标 题: H1B抽中,但是查看 Status 却告知 Validation Errors
关键字: H1B Validation Error
发信站: BBS 未名空间站 (Tue Jun 12 19:19:08 2018, 美东)
4月中旬就收到了律师转发的Form I-797C, Receipt Notice, 告知H1B抽中了,然后就
没有再去搭理这个事情。今天去USCIS网站上 Check Status, 输入I-797C Receipt
Number, 却被告知:
Validation Error(s)
You must correct the following error(s) before proceeding:
My Case Status does not recognize the receipt number entered. Please check
your receipt number and try again. ....
请问版... 阅读全帖
f****D
发帖数: 4745
49
来自主题: Immigration版 - BAOZI ask: efile 140 "Fix Errors"page
I check every items.
But still show "Fix Errors" Page!!
Fix Errors
You have attempted to certify an application that does not have all of the
suggested fields completed. It is recommended that all suggested fields be
completed in order to expedite the application process.
Please click the Fix Errors button below and you will be taken the the Form
Checklist for a listing of the forms that have errors. Any form that has
incomplete suggested fields will be in the alert section at the top of the
pag... 阅读全帖
j****e
发帖数: 198
50
还没有预约,准备填写DS160表,但是选了领事馆后,就是error:
Online Nonimmigrant Visa Application (DS-160)
Application Error
An unexpected error has occurred while processing your previous request. The
error has been reported to the site administrator; no further action is
required. To retrieve your DS-160 application, please enter your Application
ID.
有人遇到过这种情况吗??
1 2 3 4 5 6 7 8 9 10 下页 末页 (共10页)